Home

Fatal error in python

Fatal Error in Pytho

Fatal Python error: initfsencoding: unable to load the file system codec ModuleNotFoundError: No module named 'encodings' Current thread 0x00004e04 (most recent call first): my Os is Windows 10 please give me any solution when I can't code anything it gives me that error. it happened after I installed another python 2 and I'm using python 3 But when I execute ' python3.5 ' command, I get an error message as Fatal Python error: Py_Initialize: Unable to get the locale encoding. ImportError: No module named encodings . Here's the complete error message: # python3.5 Fatal Python error: Py_Initialize: Unable to get the locale encoding ImportError: No module named 'encodings' Current. This post explain a fix for How To Fix - fatal error: Python.h: No such file or directory. While building shared library using we sometimes get the below error

How to Fix Python Fatal error: Py_Initialize: Unable to

  1. Client execution returned Fatal error in Python code occurred [[6]] (code -1) occurred when trying to run rhn_check. Get this error on client servers running RHEL 6.1: 'rhn_check -vvv' showing following error: Sending back response ((6,), 'Fatal error in Python code occurred', {}
  2. I found a very simple solution to, (Pip - Fatal error in launcher:) 1) You must not have multiple environmental variables for the python path. A) Goto Environmental Variables and delete Python27 in the path if you have Python 3.6.5 installed. Pip is confused by multiple paths!!
  3. Pip version: 10.0.0 Python version: 3.6.5 64 bit Operating system: Windows 7 Ultimate, Service Pack 1, 64-bit Description: After upgrading pip to the version 10.0.0 (from Pycharm, that is using pip as a package) any attempts to start updated pip cause an error: Fatal error in launcher: Unable to create process using 'c:\program files\python 3.6\python.exe C:\Program Files\Python 3.6\Scripts\pip.EXE
  4. During a recent system update that I started using Spacewalk I stumbled upon the following error message: Fatal error in Python code occurred [[6]] After some troubleshooting I came up that I upgraded my spacewalk server to the most recenet release a couple of days ago. During this update I forgot to update also the Spacewalk client repository
python - fatal error C1083: Cannot open include file: 'io

Even if the syntax of a statement or expression is correct, it may still cause an error when executed. Python exceptions are errors that are detected during execution and are not unconditionally fatal: you will soon learn in the tutorial how to handle them in Python programs. An exception object is created when a Python script raises an exception Python3 Fatal error in launcher: Unable to create process using ''. Under windows, python2 and python3 coexist. When installing pyGame or other third-party libraries with PIP3, an error is reported as follows: Fatal error in launcher: Unable to create process using '' In some cases, fatal errors are spontaneous and temporary, and you can safely continue using the computer without any additional problems. If fatal errors persist, and especially if these errors reoccur when using the same program or performing the same task, there could be a problem with either the hardware or software on the computer I found a very simple solution to, (Pip - Fatal error in launcher:) 1) You must not have multiple environmental variables for the python path. A) Goto Environmental Variables and delete Python27 in the path if you have Python 3.6.5 installed. Pip is confused by multiple paths!!! Solution 4: run this python code

The most common reason of an error in a Python program is when a certain statement is not in accordance with the prescribed usage. Such an error is called a syntax error. The Python interpreter immediately reports it, usually along with the reason This article is dedicated to explaining, reproducing and resolving the Fatal Python Error: deallocating None which can happen while using the PyGreSQL package to query PostgreSQL data Fatal error in launcher: Unable to create process using 'c:\program files\python 3.6\python.exe C:\Program Files\Python 3.6\Scripts\pip.EXE'. Command python -m pip works as expected. I found text Fatal error in launcher only in executables: src\pip_vendor\distlib\t32.exe. src\pip_vendor\distlib\t64.exe 这篇文章主要介绍了python 解决Fatal error in launcher:错误问题,具有很好的参考价值,希望对大家有所帮助。一起跟随小编过来. Python Memory Error or in layman language is exactly what it means, you have run out of memory in your RAM for your code to execute. When this error occurs it is likely because you have loaded the entire data into memory. For large datasets, you will want to use batch processing

How To Fix - fatal error: Python

  1. @mkrizek Thank you, adding connection: local to the task did solve my issue in this case. However, later tasks that delegate_to: localhost did fail similarly, so I added connection: local at the play level which solved for the entire play. The question still remains why the behavior changed between 2.9.9 and 2.9.10 (and then later versions)?.
  2. Error : Fatal error in launcher: Unable to create process using ''Solution: python -m pip install --upgrade pipor python -m pip install package-you-want-to-..
  3. Fatal error in launcher: Unable to create process using ''. The system cannot find the path specified. The system cannot find the path specified. The system cannot find the path specified
  4. Recently, we started getting Fatal Python error: Cannot recover from. stack overflow. in the Python 3 tests (when running setup.py test), which is immediately followed by Abort trap: 6, which kills Python. In Mac OS X, this generates a problem report automatically with. logging information

Client execution returned Fatal error in Python code

Windows環境のPythonのpipでエラーが出る人向け . C:\>pip Fatal error in launcher: Unable to create process using '' これが出たときは大体PATHが汚くなってます。 複数バージョンのPythonを何も使わずに入れると発生する模様。 解決方法 とりあえず動かす C: \>python -m pi fatal error: Python.h: No such file or directory 45 | #include <Python.h> | ^~~~~~ compilation terminated. error: command 'gcc' failed with exit status 1 AttributeError: module 'yaml' has no attribute 'load_all I did a yum reinstall rhn-client-tools rhn-check rhn-setup rhnsd m2crypto yum-rhn-plugin - Fresh clone and running test_exceptions testcase caught a Seg fault. This was being run on a Centos VM. [/loc/rom/pyd/cpython] $ ./python Python 3.6.0a1+ (default:12d939477b4f, Jun 7 2016, 17:32:31) [GCC 4.4.6 20120305 (Red Hat 4.4.6-4)] on linux Type help, copyright, credits or license for more information Fatal error in launcher: Unable to create process using C:Program Files (x86)Python33python.exe C:Program Files (x86)Python33pip.exe Searching the net this seems to be a problem caused by spaces in the Python installation path

Fatal Python error: initfsencoding: unable to load the file system codec ModuleNotFoundError: No module named 'encodings' Current thread 0x00002320 (most recent call first): Y también cuando lo abro desde Visual Code lo ejecuta desde el servidor de SQL I have a hunch that you may have to run rhn-actions-control --enable-run or rhn-actions-control --enable-all on your clients. On Fri, Sep 13, 2013 at 3:11 AM, stefano ciavarella <

Even if you have knowledge of Python 2.7, you will be able to easily transition to Python 3.5 in this course. There will also be programming assignments and standalone exams/quizzes, which are not part of the video lectures. What is in it for learners. A Notion of computation. The Python programming language. Some simple algorithms. Testing and. Runtime errors are the most interesting errors which occur, if we don't consider all the corner cases. An example would be trying to access a non-existent file. In this tutorial, we'll learn how to handle errors in Python and how to log the errors for a better understanding of what went wrong inside the application. Handling Exceptions in Python Name *. E-Mail *. Website. By using this form you agree with the storage and handling of your data by this website. * Mail notifications for additional comments

python - Pip - Fatal error in launcher: Unable to create

Fatal error in launcher unable to create process using c program files x86 python34 python exe. Fatal error in launcher: Unable to create process using 'c:\program. Python confidence is way up folks and it's due to the knowledge sharing that is to be had in this group and others dedicated to the art of Python. Felt like I should share my lessons learned. I need to get better at testing. CLOB sucks so utilize sqlalchemy types for varchar. Tnsnames are not hard. 64 bit memory usage trumps 32 bit on large. Problem: I am trying to install virtualenv on Ubuntu. First it said command 'pip' not found, so I typed sudo apt install python-pip then it said E: Unable to locate package python-pip I tried to reset WSL, download using cmd but it doesn't work with Ubuntu

Fatal Error in Python

After searching the Internet, I found that I wanted to install Python devel, but I found that I couldn't solve the problem after installing according to the online command, and then I found that there was another Python 3 devel, that is, I need to install the corresponding devel according to your current version of Python in Linux, I use python3, so the corresponding installation command is Customer Problem Description ----- Problem Summary ----- OEL Spacewalk clients report fatal error in scheduled errat C&P the standalone python into the ampps/python folder and overwriting the python version provided by AMPPS; running python -m pip install --upgrade pip in cmd; Now pip and python 3 are installed in their latest version. It seems that AMPPS doesnt't provide a full-fledged python build. So you need to update python yourself. Thanks to y'all Fatal Python error: Py_Initialize: Unable to get the locale encoding ModuleNotFoundError: No module named 'encodings' Current thread 0x00007f7699284740 (most recent call first): Any idea about how to fix that please

Python Programming - Beginners Guide To Python Programming Language; What is print in Python and How to use its Parameters? Important Python Data Types You Need to Know; PyCharm Tutorial: Writing Python Code In PyCharm (IDE) Python Visual Studio- Learn How To Make Your First Python Program; What is the Main Function in Python and how to use it For tracking down the packages a file is in, use. apt-file search Python.h The list (for Ubuntu 20.04) shows two likely candidates for the latest python version: libpython3.8-dev and pypy3-dev Introduction. This article will provide a brief overview of how you can better handle PostgreSQL Python exceptions while using the psycopg2 adapter in your code. Make sure that the psycopg2 package is installed on your machine using the PIP3 package manager for Python 3 using the following command: 1. pip3 install psycopg2

Fatal Python error: Py_Initialize: Unable to get the locale encoding SyntaxError: invalid syntax Aborted (core dumped) Ask Question Asked 5 years, 11 months ago. Active 1 month ago. Viewed 94k times 19. 4. I installed anaconda by running the. bash Anaconda. Aaron Maxwell is author of Powerful Python.. Exceptions happen. And as developers, we simply have to deal with them. Even when writing software to help us find burritos

Fatal Python error: init_fs_encoding: failed to get the Python codec of the filesystem encoding. Users. jiapei100 (Pei JIA) February 11, 2020, 1:29pm #1. If I export PYTHONHOME=/usr/bin, I got the following ERRORs. build git. Syntax Errors ¶ Syntax errors Errors detected during execution are called exceptions and are not unconditionally fatal: you will soon learn how to handle them in Python programs. The Python Software Foundation is a non-profit corporation. Please donate. Last updated on Jun 03, 2021 Auto Search StackOverflow for Errors in Code using Python. 16, Mar 21. Creating and updating PowerPoint Presentations in Python using python - pptx. 15, Aug 20. Important differences between Python 2.x and Python 3.x with examples. 25, Feb 16 Fatal Python error: PyEval_RestoreThread: NULL tstate. The strange thing is that this happens in a not very predictible way; some data is loaded and displayed in a self-made Tk widget. This works. fine a couple of times and usually crashes when a widget is closed and a. new one is opend. Debugging the widget code didn't give any hints

I have a question which is closely related to this old question here: python.multiprocessing and FATAL ERROR (INFADI) MISSING DIRECTORY I have also looked at this, which seems to relate to something similar: Multiprocessing Errors - ArcGIS implementatio > utilsmodule.c:1:20: fatal error: Python.h: No such file or directory compilation terminated. I have tried all the suggested solutions over the internet but the problem still exists. I have no problem with Python.h The major difference between the Python 3.3 module and the third-party module is the implementation of dump_tracebacks_later(): Python 3.3 uses a thread with a timeout on a lock, whereas the third party uses SIGALRM and alarm(). The lock timeout, which is a new feature of Python 3.3, has a microsecond resolution WAD is able to convert fatal errors into Python exceptions that include information from the call stack as well as debugging information. By turning such errors into Python exceptions, fatal errors now result in a traceback that crosses the boundary between Python code and compiled extension code. This makes it much easier to identify and. Sent: Saturday, August 18, 2018 4:13 PM. To: [hidden email] Cc: [hidden email] Subject: BUG #15340: FATAL ERROR: The application server could not be contacted. The following bug has been logged on the website: Bug reference: 15340. Logged by: Luana Croft

fatal error: Python.h: No such file or directory. I am trying to build a shared library using a C extension file but first I have to generate the output file using the command below: utilsmodule.c:1:20: fatal error: Python.h: No such file or directory compilation terminated. in fact I have tried all the suggested solutions over the internet but. Next I builded project and builded INSTALL succesfully. But when I try to debug Blender I receive error: Fatal Python error: Py_Initialize: unable to load the file system codec blender.exe has triggered a breakpoint. Debugging stop on

windows - Fatal error in launcher: Unable to create

While trying to do multiprocessing with arcpy, I am occasionally running into this error: FATAL ERROR (INFADI) MISSING DIRECTORY I have no clue what is triggering this error, and it crashes the python process, making it impossible to get a traceback on it. It occurs while writing final raster output from a lengthy sound model CSDN问答为您找到Fatal Python error: init_fs_encoding: failed to get the Python codec of the filesystem encoding相关问题答案,如果想了解更多关于Fatal Python error: init_fs_encoding: failed to get the Python codec of the filesystem encoding技术问题等相关问答,请访问CSDN问答 Fatal Python error: Py_Initialize: Unable to get the locale. Ask Question Asked 3 years, 11 months ago. Active 3 years, 11 months ago. Viewed 1k times 0. I'm trying to use UWSGI with a virtualenv. My app ini is: [uwsgi] dir. This BZ closed some time during 2.5, 2.6 or 2.7. Adding to 2.7 tracking bug. Note You need to log in before you can comment on or make changes to this bug. You need.

Spacewalk: Fatal error in Python code occurred [[6

CSDN问答为您找到Fatal Python error: take_gil: NULL tstate in python 3.6.6 on macOS 10.13.6相关问题答案,如果想了解更多关于Fatal Python error: take_gil: NULL tstate in python 3.6.6 on macOS 10.13.6技术问题等相关问答,请访问CSDN问答 Recently while trying to install recent version of psutil I got following error: psutil/_psutil_linux.c:12:20: fatal error: Python.h: No such file or directory compilation terminated. After debugg I renamed the executable of python.exe to e.g. python27.exe. In respect to the answer of Archimedix I opened my pip.exe with a Hex-Editor, scrolled to the end of the file and changed the python.exe in the path to python27.exe. While editing make shure you don't override other informations. python.exe. python27.exe. python.exe. python27.ex How to resolve the fatal error: Python.h: no such file oy directory? I am trying to create a shared library utilizing c extension file, but first I have to produce the output file using the command below. gcc -Wall utilsmodule.c -o Utilc. After executing this common, I am getting the error

(Tutorial) Exception and Error Handling in Python - DataCam

I'm trying to install 3rd party python apps using pip command and getting the following error: gcc -pthread -fno-strict-aliasing -fwrapv -Wall -Wstrict-prototypes -fPIC -std=c99 -O3 -fomit-frame-pointer -Isrc/ -I/usr/include/python2.7 -c src/MD2.c -o build/temp.linux-x86_64-2.7/src/MD2.o src/MD2.c:31:20: fatal error: Python.h: No such file or directory compilation terminated. error: command. There are similar apps on windows, but I thought this could be useful for other programs in python where you got to get some images from the computer screen, so that you can use them. In particular, I got the intention to make a simple script where I get a screen portion and then I get the text out of the picture ready to be used in some text editor In effect, exceptions allow the Python programmer to concentrate on his actual program, rather than be responsible for building error-handling infrastructure into every function. Python supplies that infrastructure for you, in the form of exceptions A Computer Science portal for geeks. It contains well written, well thought and well explained computer science and programming articles, quizzes and practice/competitive programming/company interview Questions Fatal Python error: could not acquire lock for <_io.BufferedWritername='<stdout>'> at interpreter shutdown, possibly due to daemon threads Under Python 2.7, no errors. I'm not aware why would this happen, however, I've been looking around in bufferedio.c

Strengthen your foundations with the Python Programming Foundation Course and learn the basics. To begin with, your interview preparations Enhance your Data Structures concepts with the Python DS Course. And to begin with your Machine Learning Journey, join the Machine Learning - Basic Level Course fatal error: Python.h: No Such File or Directory when compiling python file to a c executable file? Ask Question Asked 4 years, 9 months ago. Active 4 years, 9 months ago. Viewed 30k times 8. 3. I am trying to compile c from python. There shows. When run python3 setup.py install, I have errors as follows. fatal error: Python.h: No such file or directory #include <Python.h> ^~~~~~ compilation terminated. error: command 'x86_64-linux-gnu-gcc' failed with exit status 1 I have. 3. This is python code extending with C. No need to use make. Python itself will take care of the cpp code compilation with proper flags. First you need to have header files and a static library. Install those as, sudo apt-get install python-dev. Now follow these commands to execute example.py in your code

Fatal python error: initfsencoding: unable to load the file system codec. Problem: I have created a .exe file of a simple script with intentions to run it on a server however I cannot seem to figure out what this fault means or find any answers online.Any help is appreciated Fatal Python error: Segmentation fault running (play) USD stage after URDF import. Autonomous Machines. Isaac. Omniverse Isaac Sim. toni.sm. July 22, 2020, 10:44am #1. Hi everyone, I implemented custom sceneries to make some simulations First, please try updating the graphic card driver and make sure it is working properly. If this don't fix the issue, Try this: Right-click on the Creo Parametric shortcut on the desktop and go to properties. Add space after the existing target path and then -g:win32_gdi

Python3 Fatal error in launcher: Unable to create process

parser for a networking protocol) happend to be terribly slow, while. quite a simple piece of code, so I decided to reimplement it in C. However, my code seems to do something in err, since the program. semi-randomly locks somewhere outside my C-code (after returning to. python), and semi-randomly issues a Fatal error: GC object already Sarah Follow us. Position: Columnist Sarah is working as editor at MiniTool since she was graduated from university, having rich writing experiences. Love to help other people out from computer problems, disk issues, and data loss dilemma and specialize in these things Quick Reach 1 Python Exceptions 2 How to raise an exception 2.1 Syntax of using try except in Python 3 An exception example of Python 4 try except Python with user input example 5 Python try except with else for multiple exceptions Python Exceptions The Exception is an object in [ initialising pygame Fatal Python error: (pygame parachute) Segmentation Fault Aborted which helps you to isolate where the problem happened. Second, cx_freeze is rather tricky. cxfreeze game.py might not be enough to get a working executable. It is a far better practice to set up a setup.py file

I'm try to run python code in my android app using Chaquopy, I'm also using the moviepy library (I'm converting a mp4 file to a gif file I'm using Python embedded in my app, and I've run into problems creating my own modules. I'm using Python version 2.3 compiled with MSVC .NET (not 2003). When I call Py_InitModule I get the message: Fatal Python error: Interpreter not initialized (version mismatch?) However, Python does seem to be initialized. Py_IsInitialized() returns 1, and home > topics > python > questions > fatal python error: deallocating none Post your question to a community of 468,357 developers. It's quick & easy. Fatal Python error: deallocating None. George Sakkis. It's the first time in the three years I've been using python that a. Windows系统下,pycharm编译器运行.py文件出现:Fatal Python error: Aborted错误。具体情况如下:Thread 0x000013b8 (most recent call first): File D:\anaconda\envs\tensorflow-gpu\lib\site-packages\tensorflow\python\client\session.py, line 1429 in _call_tf_sessionru

Fatal Error: What It Is and How to Fix It - Lifewir

-- Clifford Perry Manager, Satellite Engineering Red Hat, Inc. http://www.redhat.com/ +1 919 754 4403 RHCA / RHCE# 80500768012820 Fatal Python error: Python memory allocator called without holding the GIL Python runtime state: initialized <various python stack traces> </various> The stack traces don't seem meaningful. I ran the test in gdb, and got the following backtrace

Pip - Fatal error in launcher: Unable to create process

  1. python中使用pip安装模块时,出现:Fatal error in launcher: Unable to create process using '' 原因:系统
  2. ROS Noetic Windows 10 Fatal Python error: init_fs_encoding: failed to get the Python codec of the filesystem encoding Python runtime state: core initialized ModuleNotFoundError: No module named 'encodings' [closed] edit. noetic. 2.windows10. asked 2020-12-17 00:08:27 -0500
  3. Fatal Python error: Py_Initialize: unable to load the file system codec ImportError: No module named 'encodings' Current thread 0x00001828 (most recent call first): Cause. The failure is caused by a corrupt SnowSQL installation in the user profile
  4. PYTHONPATH=target/debug/ python -c import libhello_world Fatal Python error: PyThreadState_Get: no current thread Abort trap: 6. After I compiled the rust code, I didn't get a .so file. I'm working around that for now by doing (cd target/debug/ && ln -s libhello_world.dylib libhello_world.so). I also get a compile failure unless I export PKG.
  5. Fatal Python error: PyImport_GetModuleDict: no module dictionary! Leaking python objects bridged to UNO for reason pyuno runtime is not initialized, (the pyuno.bootstrap needs to be called before using any uno classes) Fatal Python error: PyImport_GetModuleDict: no module dictionary

Error Types in Python - TutorialsTeache

  1. Santi Saez wrote: Hi Clifford, El 9/2/09 14:00, Clifford Perry escribió: First suggest - upgrade version of up2date - -rw-rw-r-- 4 ftp ftp 2142836 Jul 01 2008.
  2. 在终端输入jupyter notebook之后无法正常启动jupyter, 报错 E:\python_note\test1>jupyter notebook Fatal error in la
  3. February 1, 2021 jupyter-notebook, python, python-3.x, visual-studio-code I have only installed python 3.7.8 64-bit on windows 10 today. I did use 3.7.8 32-bit version before but now I have to use 64 bit version due to some package requirement
  4. python安装了2和3版本在 cmd 中用pip报的错误为:Fatal error in launcher:Unable to create process using 这是因为你安装了python
  5. Resolving the Fatal Python Error when using PyGreSQL by
  6. Fatal error in launcher: Unable to create process using
python - LINK : fatal error LNK1104: cannot open fileLINK : fatal error LNK1123: COFF로 변환하는 동안 오류가 발생했습니다gcc - LINK: fatal error LNK1181: cannot open input filePython: pip install pylintのエラー対処(Windows) - ikuyani knowledgeanaconda 실행 에러[MFC] fatal error LNK1104:cannot open file &#39;mfc90uFatal Attraction Rabbit Scene GIFs | Tenor
  • Grin wallet ios.
  • Idiopathic interstitial pneumonia treatment.
  • Estimate pleural effusion volume.
  • Jp morgan management.
  • P2p binance c'est quoi.
  • Referral marketing svenska.
  • Most scalable blockchain.
  • Legalett Byggsystem AB Älvängen.
  • Svedbergs utdelning 2021.
  • Explain xkcd 2054.
  • KYC requirements for corporates UK.
  • Duni Servietten kaufen Schweiz.
  • How to use Samsung Blockchain Keystore.
  • Elskling.
  • Xkcd 1652.
  • Spiltan Enkel Morningstar.
  • Lön verksamhetsutvecklare studieförbund.
  • Crypto Queens imeleta.
  • Gunbot Linux.
  • Goldpreis 1970 bis heute.
  • Eos lip balm tesco.
  • Börshajen.
  • Solsidan Mölnlycke.
  • Student loan forum.
  • Loopring liquidity mining.
  • MACD and Stochastic trading strategy PDF.
  • Bambuser investor Relations.
  • MinerGate XMR pool address.
  • Youtube chipping.
  • Fastighetsbolag Landskrona.
  • MTB Hjo.
  • New Wave Profile.
  • Pensionsrådgivning Folksam.
  • Interhome denemarken.
  • Binary options meaning.
  • ESG investing quotes.
  • Stephen m. scherr education.
  • Tesco Clubcard app.
  • Sickla Galleria.
  • Binary trading review.
  • Miku Spanish voicebank.